isa_year,level_all_num,level1_num,level2_num,level3_num,level4_num,level5_num,level6_num,level1_char,level2_char,level3_char,level4_char,level5_char,level6_char,chapter_category,topic,discipline
2013,3,3,.,.,.,.,.,Atmospheric Chemistry and Ambient Concentrations,,,,,,Atmospheric,Supplementary,Atmospheric
2013,3.1,3,1,.,.,.,.,Atmospheric Chemistry and Ambient Concentrations,Introduction,,,,,Atmospheric,Supplementary,Atmospheric
2013,3.2,3,2,.,.,.,.,Atmospheric Chemistry and Ambient Concentrations,Physical and Chemical Processes,,,,,Atmospheric,Modeling-Meteorology-Chemistry,Atmospheric
2013,3.2.1,3,2,1,.,.,.,Atmospheric Chemistry and Ambient Concentrations,Physical and Chemical Processes,Sources of Precursors Involved in O3 Formation,,,,Atmospheric,Precursor Sources,Atmospheric
2013,3.2.2,3,2,2,.,.,.,Atmospheric Chemistry and Ambient Concentrations,Physical and Chemical Processes,Gas Phase Reactions Leading to O3 Formation,,,,Atmospheric,Modeling-Meteorology-Chemistry,Atmospheric
2013,3.2.3,3,2,3,.,.,.,Atmospheric Chemistry and Ambient Concentrations,Physical and Chemical Processes,Multiphase Processes,,,,Atmospheric,Modeling-Meteorology-Chemistry,Atmospheric
2013,3.2.3.1,3,2,3,1,.,.,Atmospheric Chemistry and Ambient Concentrations,Physical and Chemical Processes,Multiphase Processes,Indoor Air,,,Atmospheric,Modeling-Meteorology-Chemistry,Atmospheric
2013,3.2.4,3,2,4,.,.,.,Atmospheric Chemistry and Ambient Concentrations,Physical and Chemical Processes,Temperature and Chemical Precursor Relationships,,,,Atmospheric,Modeling-Meteorology-Chemistry,Atmospheric
2013,3.3,3,3,.,.,.,.,Atmospheric Chemistry and Ambient Concentrations,Atmospheric Modeling,,,,,Atmospheric,Modeling-Meteorology-Chemistry,Atmospheric
2013,3.3.1,3,3,1,.,.,.,Atmospheric Chemistry and Ambient Concentrations,Atmospheric Modeling,Global Scale CTMs,,,,Atmospheric,Modeling-Meteorology-Chemistry,Atmospheric
2013,3.4,3,4,.,.,.,.,Atmospheric Chemistry and Ambient Concentrations,Background O3 Concentrations,,,,,Atmospheric,Background ozone,Atmospheric
2013,3.4.1,3,4,1,.,.,.,Atmospheric Chemistry and Ambient Concentrations,Background O3 Concentrations,Contributions from Natural Sources,,,,Atmospheric,Background ozone,Atmospheric
2013,3.4.1.1,3,4,1,1,.,.,Atmospheric Chemistry and Ambient Concentrations,Background O3 Concentrations,Contributions from Natural Sources,Contributions from the Stratosphere,,,Atmospheric,Background ozone,Atmospheric
2013,3.4.1.2,3,4,1,2,.,.,Atmospheric Chemistry and Ambient Concentrations,Background O3 Concentrations,Contributions from Natural Sources,Contributions from Other Natural Sources,,,Atmospheric,Background ozone,Atmospheric
2013,3.4.2,3,4,2,.,.,.,Atmospheric Chemistry and Ambient Concentrations,Background O3 Concentrations,Contributions from Anthropogenic Emissions,,,,Atmospheric,Background ozone,Atmospheric
2013,3.4.3,3,4,3,.,.,.,Atmospheric Chemistry and Ambient Concentrations,Background O3 Concentrations,Estimating Background Concentrations,,,,Atmospheric,Background ozone,Atmospheric
2013,3.4.3.1,3,4,3,1,.,.,Atmospheric Chemistry and Ambient Concentrations,Background O3 Concentrations,Estimating Background Concentrations,Updated GEOS-Chem Model Estimates of Background Concentrations,,,Atmospheric,Background ozone,Atmospheric
2013,3.4.3.2,3,4,3,2,.,.,Atmospheric Chemistry and Ambient Concentrations,Background O3 Concentrations,Estimating Background Concentrations,Using Other Models to Estimate Background Concentrations,,,Atmospheric,Background ozone,Atmospheric
2013,3.5,3,5,.,.,.,.,Atmospheric Chemistry and Ambient Concentrations,Monitoring,,,,,Atmospheric,Supplementary,Atmospheric
2013,3.5.1,3,5,1,.,.,.,Atmospheric Chemistry and Ambient Concentrations,Monitoring,Routine Monitoring Techniques,,,,Atmospheric,Measurement,Atmospheric
2013,3.5.2,3,5,2,.,.,.,Atmospheric Chemistry and Ambient Concentrations,Monitoring,Precision and Bias,,,,Atmospheric,Supplementary,Atmospheric
2013,3.5.2.1,3,5,2,1,.,.,Atmospheric Chemistry and Ambient Concentrations,Monitoring,Precision and Bias,Precision from Co-located UV O3 Monitors in Missouri,,,Atmospheric,Supplementary,Atmospheric
2013,3.5.3,3,5,3,.,.,.,Atmospheric Chemistry and Ambient Concentrations,Monitoring,Performance Specifications,,,,Atmospheric,Supplementary,Atmospheric
2013,3.5.4,3,5,4,.,.,.,Atmospheric Chemistry and Ambient Concentrations,Monitoring,Monitor Calibration,,,,Atmospheric,Measurement,Atmospheric
2013,3.5.5,3,5,5,.,.,.,Atmospheric Chemistry and Ambient Concentrations,Monitoring,Other Monitoring Techniques,,,,Atmospheric,Measurement,Atmospheric
2013,3.5.5.1,3,5,5,1,.,.,Atmospheric Chemistry and Ambient Concentrations,Monitoring,Other Monitoring Techniques,Portable UV O3 Monitors,,,Atmospheric,Measurement,Atmospheric
2013,3.5.5.2,3,5,5,2,.,.,Atmospheric Chemistry and Ambient Concentrations,Monitoring,Other Monitoring Techniques,NO-based Chemiluminescence Monitors,,,Atmospheric,Measurement,Atmospheric
2013,3.5.5.3,3,5,5,3,.,.,Atmospheric Chemistry and Ambient Concentrations,Monitoring,Other Monitoring Techniques,Passive Air Sampling Devices and Sensors,,,Atmospheric,Measurement,Atmospheric
2013,3.5.5.4,3,5,5,4,.,.,Atmospheric Chemistry and Ambient Concentrations,Monitoring,Other Monitoring Techniques,Differential Optical Absorption Spectrometry,,,Atmospheric,Measurement,Atmospheric
2013,3.5.5.5,3,5,5,5,.,.,Atmospheric Chemistry and Ambient Concentrations,Monitoring,Other Monitoring Techniques,Satellite Remote Sensing,,,Atmospheric,Satellite Remote Sensing,Atmospheric
2013,3.5.6,3,5,6,.,.,.,Atmospheric Chemistry and Ambient Concentrations,Monitoring,Ambient O3 Network Design,,,,Atmospheric,Supplementary,Atmospheric
2013,3.5.6.1,3,5,6,1,.,.,Atmospheric Chemistry and Ambient Concentrations,Monitoring,Ambient O3 Network Design,Monitor Siting Requirements,,,Atmospheric,Supplementary,Atmospheric
2013,3.5.6.2,3,5,6,2,.,.,Atmospheric Chemistry and Ambient Concentrations,Monitoring,Ambient O3 Network Design,Probe/Inlet Siting Requirements,,,Atmospheric,Supplementary,Atmospheric
2013,3.6,3,6,.,.,.,.,Atmospheric Chemistry and Ambient Concentrations,Ambient Concentrations,,,,,Atmospheric,Supplementary,Atmospheric
2013,3.6.1,3,6,1,.,.,.,Atmospheric Chemistry and Ambient Concentrations,Ambient Concentrations,"Measurement Units, Metrics, and Averaging Times",,,,Atmospheric,Supplementary,Atmospheric
2013,3.6.2,3,6,2,.,.,.,Atmospheric Chemistry and Ambient Concentrations,Ambient Concentrations,Spatial Variability,,,,Atmospheric,Supplementary,Atmospheric
2013,3.6.2.1,3,6,2,1,.,.,Atmospheric Chemistry and Ambient Concentrations,Ambient Concentrations,Spatial Variability,Urban-Focused Variability,,,Atmospheric,Near Road Gradient,Atmospheric
2013,3.6.2.2,3,6,2,2,.,.,Atmospheric Chemistry and Ambient Concentrations,Ambient Concentrations,Spatial Variability,Rural-Focused Variability and Ground-level Vertical Gradients,,,Atmospheric,Supplementary,Atmospheric
2013,3.6.3,3,6,3,.,.,.,Atmospheric Chemistry and Ambient Concentrations,Ambient Concentrations,Temporal Variability,,,,Atmospheric,Supplementary,Atmospheric
2013,3.6.3.1,3,6,3,1,.,.,Atmospheric Chemistry and Ambient Concentrations,Ambient Concentrations,Temporal Variability,Multiyear Trends,,,Atmospheric,Multiyear Trends,Atmospheric
2013,3.6.3.2,3,6,3,2,.,.,Atmospheric Chemistry and Ambient Concentrations,Ambient Concentrations,Temporal Variability,Hourly Variations,,,Atmospheric,Multiyear Trends,Atmospheric
2013,3.6.4,3,6,4,.,.,.,Atmospheric Chemistry and Ambient Concentrations,Ambient Concentrations,Associations with Copollutants,,,,Atmospheric,Supplementary,Atmospheric
2013,3.7,3,7,.,.,.,.,Atmospheric Chemistry and Ambient Concentrations,Chapter�Summary,,,,,Atmospheric,Supplementary,Atmospheric
2013,3.7.1,3,7,1,.,.,.,Atmospheric Chemistry and Ambient Concentrations,Chapter�Summary,Physical and Chemical Processes,,,,Atmospheric,Supplementary,Atmospheric
2013,3.7.2,3,7,2,.,.,.,Atmospheric Chemistry and Ambient Concentrations,Chapter�Summary,Atmospheric Modeling,,,,Atmospheric,Supplementary,Atmospheric
2013,3.7.3,3,7,3,.,.,.,Atmospheric Chemistry and Ambient Concentrations,Chapter�Summary,Background Concentrations,,,,Atmospheric,Supplementary,Atmospheric
2013,3.7.4,3,7,4,.,.,.,Atmospheric Chemistry and Ambient Concentrations,Chapter�Summary,Monitoring,,,,Atmospheric,Supplementary,Atmospheric
2013,3.7.5,3,7,5,.,.,.,Atmospheric Chemistry and Ambient Concentrations,Chapter�Summary,Ambient Concentrations,,,,Atmospheric,Supplementary,Atmospheric
2013,3.8,3,8,.,.,.,.,Atmospheric Chemistry and Ambient Concentrations,Supplemental Information on O3 Model Predictions,,,,,Atmospheric,Model predictions,Atmospheric
2013,3.9,3,9,.,.,.,.,Atmospheric Chemistry and Ambient Concentrations,Supplemental Figures of Observed Ambient O3 Concentrations,,,,,Atmospheric,Supplementary,Atmospheric
2013,3.9.1,3,9,1,.,.,.,Atmospheric Chemistry and Ambient Concentrations,Supplemental Figures of Observed Ambient O3 Concentrations,Ozone Monitor Maps for the Urban Focus Cities,,,,Atmospheric,Supplementary,Atmospheric
2013,3.9.2,3,9,2,.,.,.,Atmospheric Chemistry and Ambient Concentrations,Supplemental Figures of Observed Ambient O3 Concentrations,Ozone Concentration Box Plots for the Urban Focus Cities,,,,Atmospheric,Supplementary,Atmospheric
2013,3.9.3,3,9,3,.,.,.,Atmospheric Chemistry and Ambient Concentrations,Supplemental Figures of Observed Ambient O3 Concentrations,Ozone Concentration Relationships for the Urban Focus Cities,,,,Atmospheric,Supplementary,Atmospheric
2013,3.9.4,3,9,4,.,.,.,Atmospheric Chemistry and Ambient Concentrations,Supplemental Figures of Observed Ambient O3 Concentrations,Hourly Variations in O3 for the Urban Focus Cities,,,,Atmospheric,Supplementary,Atmospheric
2013,4,4,.,.,.,.,.,Exposure to Ambient Ozone,,,,,,Exposure,Supplementary,Exposure
2013,4.1,4,1,.,.,.,.,Exposure to Ambient Ozone,Introduction,,,,,Exposure,Supplementary,Exposure
2013,4.2,4,2,.,.,.,.,Exposure to Ambient Ozone,General Exposure Concepts,,,,,Exposure,Exposure,Exposure
2013,4.3,4,3,.,.,.,.,Exposure to Ambient Ozone,Exposure Measurement,,,,,Exposure,Exposure,Exposure
2013,4.3.1,4,3,1,.,.,.,Exposure to Ambient Ozone,Exposure Measurement,Personal Monitoring Techniques,,,,Exposure,Exposure,Exposure
2013,4.3.2,4,3,2,.,.,.,Exposure to Ambient Ozone,Exposure Measurement,Indoor-Outdoor Concentration Relationships,,,,Exposure,Exposure,Exposure
2013,4.3.3,4,3,3,.,.,.,Exposure to Ambient Ozone,Exposure Measurement,Personal-Ambient Concentration Relationships,,,,Exposure,Exposure,Exposure
2013,4.3.4,4,3,4,.,.,.,Exposure to Ambient Ozone,Exposure Measurement,Co-exposure to Other Pollutants and Environmental Stressors,,,,Exposure,Exposure,Exposure
2013,4.3.4.1,4,3,4,1,.,.,Exposure to Ambient Ozone,Exposure Measurement,Co-exposure to Other Pollutants and Environmental Stressors,Personal Exposure to Ozone and Copollutants,,,Exposure,Exposure,Exposure
2013,4.3.4.2,4,3,4,2,.,.,Exposure to Ambient Ozone,Exposure Measurement,Co-exposure to Other Pollutants and Environmental Stressors,Near-Road Exposure to Ozone and Copollutants,,,Exposure,Exposure,Exposure
2013,4.3.4.3,4,3,4,3,.,.,Exposure to Ambient Ozone,Exposure Measurement,Co-exposure to Other Pollutants and Environmental Stressors,Indoor Exposure to Ozone and Copollutants,,,Exposure,Exposure,Exposure
2013,4.4,4,4,.,.,.,.,Exposure to Ambient Ozone,Exposure-Related Metrics,,,,,Exposure,Exposure,Exposure
2013,4.4.1,4,4,1,.,.,.,Exposure to Ambient Ozone,Exposure-Related Metrics,Activity Patterns,,,,Exposure,Exposure,Exposure
2013,4.4.2,4,4,2,.,.,.,Exposure to Ambient Ozone,Exposure-Related Metrics,Ozone-Averting Behavior,,,,Exposure,Exposure,Exposure
2013,4.4.3,4,4,3,.,.,.,Exposure to Ambient Ozone,Exposure-Related Metrics,Population Proximity to Fixed-Site Ozone Monitors,,,,Exposure,Exposure,Exposure
2013,4.5,4,5,.,.,.,.,Exposure to Ambient Ozone,Exposure Modeling,,,,,Exposure,Exposure,Exposure
2013,4.5.1,4,5,1,.,.,.,Exposure to Ambient Ozone,Exposure Modeling,Concentration Surface Modeling,,,,Exposure,Exposure,Exposure
2013,4.5.2,4,5,2,.,.,.,Exposure to Ambient Ozone,Exposure Modeling,Residential Air Exchange Rate Modeling,,,,Exposure,Exposure,Exposure
2013,4.5.3,4,5,3,.,.,.,Exposure to Ambient Ozone,Exposure Modeling,Microenvironment-Based Models,,,,Exposure,Exposure,Exposure
2013,4.6,4,6,.,.,.,.,Exposure to Ambient Ozone,Implications for Epidemiologic Studies,,,,,Exposure,Exposure,Exposure
2013,4.6.1,4,6,1,.,.,.,Exposure to Ambient Ozone,Implications for Epidemiologic Studies,Non-Ambient Ozone Exposure,,,,Exposure,Exposure,Exposure
2013,4.6.2,4,6,2,.,.,.,Exposure to Ambient Ozone,Implications for Epidemiologic Studies,Spatial and Temporal Variability,,,,Exposure,Exposure,Exposure
2013,4.6.2.1,4,6,2,1,.,.,Exposure to Ambient Ozone,Implications for Epidemiologic Studies,Spatial and Temporal Variability,Spatial Variability,,,Exposure,Exposure,Exposure
2013,4.6.2.2,4,6,2,2,.,.,Exposure to Ambient Ozone,Implications for Epidemiologic Studies,Spatial and Temporal Variability,Seasonality,,,Exposure,Exposure,Exposure
2013,4.6.3,4,6,3,.,.,.,Exposure to Ambient Ozone,Implications for Epidemiologic Studies,Exposure Duration,,,,Exposure,Exposure,Exposure
2013,4.6.3.1,4,6,3,1,.,.,Exposure to Ambient Ozone,Implications for Epidemiologic Studies,Exposure Duration,Short-Term Exposure,,,Exposure,Exposure,Exposure
2013,4.6.3.2,4,6,3,2,.,.,Exposure to Ambient Ozone,Implications for Epidemiologic Studies,Exposure Duration,Long-Term Exposure,,,Exposure,Exposure,Exposure
2013,4.6.4,4,6,4,.,.,.,Exposure to Ambient Ozone,Implications for Epidemiologic Studies,Relationship between Personal Exposure and Ambient Concentration,,,,Exposure,Exposure,Exposure
2013,4.6.5,4,6,5,.,.,.,Exposure to Ambient Ozone,Implications for Epidemiologic Studies,Exposure to Copollutants and Ozone Reaction Products,,,,Exposure,Exposure,Exposure
2013,4.6.6,4,6,6,.,.,.,Exposure to Ambient Ozone,Implications for Epidemiologic Studies,Averting Behavior,,,,Exposure,Exposure,Exposure
2013,4.6.7,4,6,7,.,.,.,Exposure to Ambient Ozone,Implications for Epidemiologic Studies,Exposure Estimation Methods in Epidemiologic Studies,,,,Exposure,Exposure,Exposure
2013,4.7,4,7,.,.,.,.,Exposure to Ambient Ozone,Summary and Conclusions,,,,,Exposure,Supplementary,Exposure
2013,5,5,.,.,.,.,.,"Dosimetry, Mode of Action, and Species Homology",,,,,,Health,Dosimetry deprecated,
2013,5.1,5,1,.,.,.,.,"Dosimetry, Mode of Action, and Species Homology",Introduction,,,,,Health,Dosimetry deprecated,
2013,5.2,5,2,.,.,.,.,"Dosimetry, Mode of Action, and Species Homology",Human and Animal Ozone Dosimetry,,,,,Health,Dosimetry deprecated,
2013,5.2.1,5,2,1,.,.,.,"Dosimetry, Mode of Action, and Species Homology",Human and Animal Ozone Dosimetry,Introduction,,,,Health,Dosimetry deprecated,
2013,5.2.2,5,2,2,.,.,.,"Dosimetry, Mode of Action, and Species Homology",Human and Animal Ozone Dosimetry,Ozone Uptake,,,,Health,Dosimetry deprecated,
2013,5.2.2.1,5,2,2,1,.,.,"Dosimetry, Mode of Action, and Species Homology",Human and Animal Ozone Dosimetry,Ozone Uptake,Gas Transport Principles,,,Health,Dosimetry deprecated,
2013,5.2.2.2,5,2,2,2,.,.,"Dosimetry, Mode of Action, and Species Homology",Human and Animal Ozone Dosimetry,Ozone Uptake,Target Sites for Ozone Dose,,,Health,Dosimetry deprecated,
2013,5.2.2.3,5,2,2,3,.,.,"Dosimetry, Mode of Action, and Species Homology",Human and Animal Ozone Dosimetry,Ozone Uptake,Upper Respiratory Tract Ozone Removal and Dose,,,Health,Dosimetry deprecated,
2013,5.2.2.4,5,2,2,4,.,.,"Dosimetry, Mode of Action, and Species Homology",Human and Animal Ozone Dosimetry,Ozone Uptake,Lower Respiratory Tract Ozone Uptake and Dose,,,Health,Dosimetry deprecated,
2013,5.2.2.5,5,2,2,5,.,.,"Dosimetry, Mode of Action, and Species Homology",Human and Animal Ozone Dosimetry,Ozone Uptake,Mode of Breathing,,,Health,Dosimetry deprecated,
2013,5.2.2.6,5,2,2,6,.,.,"Dosimetry, Mode of Action, and Species Homology",Human and Animal Ozone Dosimetry,Ozone Uptake,Interindividual Variability in Dose,,,Health,Dosimetry deprecated,
2013,5.2.2.7,5,2,2,7,.,.,"Dosimetry, Mode of Action, and Species Homology",Human and Animal Ozone Dosimetry,Ozone Uptake,Physical Activity,,,Health,Dosimetry deprecated,
2013,5.2.2.8,5,2,2,8,.,.,"Dosimetry, Mode of Action, and Species Homology",Human and Animal Ozone Dosimetry,Ozone Uptake,Summary,,,Health,Dosimetry deprecated,
2013,5.2.3,5,2,3,.,.,.,"Dosimetry, Mode of Action, and Species Homology",Human and Animal Ozone Dosimetry,Ozone Reactions and Reaction Products,,,,Health,Dosimetry deprecated,
2013,5.2.3.1,5,2,3,1,.,.,"Dosimetry, Mode of Action, and Species Homology",Human and Animal Ozone Dosimetry,Ozone Reactions and Reaction Products,Summary,,,Health,Dosimetry deprecated,
2013,5.3,5,3,.,.,.,.,"Dosimetry, Mode of Action, and Species Homology",Possible Pathways/Modes of Action,,,,,Health,Dosimetry deprecated,
2013,5.3.1,5,3,1,.,.,.,"Dosimetry, Mode of Action, and Species Homology",Possible Pathways/Modes of Action,Introduction,,,,Health,Dosimetry deprecated,
2013,5.3.2,5,3,2,.,.,.,"Dosimetry, Mode of Action, and Species Homology",Possible Pathways/Modes of Action,Activation of Neural Reflexes,,,,Health,Dosimetry deprecated,
2013,5.3.3,5,3,3,.,.,.,"Dosimetry, Mode of Action, and Species Homology",Possible Pathways/Modes of Action,Initiation of inflammation,,,,Health,Dosimetry deprecated,
2013,5.3.4,5,3,4,.,.,.,"Dosimetry, Mode of Action, and Species Homology",Possible Pathways/Modes of Action,Alteration of Epithelial Barrier Function,,,,Health,Dosimetry deprecated,
2013,5.3.5,5,3,5,.,.,.,"Dosimetry, Mode of Action, and Species Homology",Possible Pathways/Modes of Action,Sensitization of Bronchial Smooth Muscle,,,,Health,Dosimetry deprecated,
2013,5.3.6,5,3,6,.,.,.,"Dosimetry, Mode of Action, and Species Homology",Possible Pathways/Modes of Action,Modification of Innate/Adaptive Immune System Responses,,,,Health,Dosimetry deprecated,
2013,5.3.7,5,3,7,.,.,.,"Dosimetry, Mode of Action, and Species Homology",Possible Pathways/Modes of Action,Airways Remodeling,,,,Health,Dosimetry deprecated,
2013,5.3.8,5,3,8,.,.,.,"Dosimetry, Mode of Action, and Species Homology",Possible Pathways/Modes of Action,Systemic Inflammation and Oxidative/Nitrosative Stress,,,,Health,Dosimetry deprecated,
2013,5.3.9,5,3,9,.,.,.,"Dosimetry, Mode of Action, and Species Homology",Possible Pathways/Modes of Action,Impaired Alveolar-Arterial Oxygen Transfer,,,,Health,Dosimetry deprecated,
2013,5.3.10,5,3,10,.,.,.,"Dosimetry, Mode of Action, and Species Homology",Possible Pathways/Modes of Action,Summary,,,,Health,Dosimetry deprecated,
2013,5.4,5,4,.,.,.,.,"Dosimetry, Mode of Action, and Species Homology",Interindividual Variability in Response,,,,,Health,Dosimetry deprecated,
2013,5.4.1,5,4,1,.,.,.,"Dosimetry, Mode of Action, and Species Homology",Interindividual Variability in Response,Dosimetric Considerations,,,,Health,Dosimetry deprecated,
2013,5.4.2,5,4,2,.,.,.,"Dosimetry, Mode of Action, and Species Homology",Interindividual Variability in Response,Mechanistic Considerations,,,,Health,Dosimetry deprecated,
2013,5.4.2.1,5,4,2,1,.,.,"Dosimetry, Mode of Action, and Species Homology",Interindividual Variability in Response,Mechanistic Considerations,Gene-environment Interactions,,,Health,Dosimetry deprecated,
2013,5.4.2.2,5,4,2,2,.,.,"Dosimetry, Mode of Action, and Species Homology",Interindividual Variability in Response,Mechanistic Considerations,Pre-existing Diseases and Conditions,,,Health,Dosimetry deprecated,
2013,5.4.2.3,5,4,2,3,.,.,"Dosimetry, Mode of Action, and Species Homology",Interindividual Variability in Response,Mechanistic Considerations,Nutritional Status,,,Health,Dosimetry deprecated,
2013,5.4.2.4,5,4,2,4,.,.,"Dosimetry, Mode of Action, and Species Homology",Interindividual Variability in Response,Mechanistic Considerations,Lifestage,,,Health,Dosimetry deprecated,
2013,5.4.2.5,5,4,2,5,.,.,"Dosimetry, Mode of Action, and Species Homology",Interindividual Variability in Response,Mechanistic Considerations,Attenuation of Responses,,,Health,Dosimetry deprecated,
2013,5.4.2.6,5,4,2,6,.,.,"Dosimetry, Mode of Action, and Species Homology",Interindividual Variability in Response,Mechanistic Considerations,Co-exposures with Particulate Matter,,,Health,Dosimetry deprecated,
2013,5.4.2.7,5,4,2,7,.,.,"Dosimetry, Mode of Action, and Species Homology",Interindividual Variability in Response,Mechanistic Considerations,Summary,,,Health,Dosimetry deprecated,
2013,5.5,5,5,.,.,.,.,"Dosimetry, Mode of Action, and Species Homology",Species Homology and Interspecies Sensitivity,,,,,Health,Dosimetry deprecated,
2013,5.5.1,5,5,1,.,.,.,"Dosimetry, Mode of Action, and Species Homology",Species Homology and Interspecies Sensitivity,Interspecies Dosimetry,,,,Health,Dosimetry deprecated,
2013,5.5.2,5,5,2,.,.,.,"Dosimetry, Mode of Action, and Species Homology",Species Homology and Interspecies Sensitivity,Interspecies Homology of Response,,,,Health,Dosimetry deprecated,
2013,5.5.3,5,5,3,.,.,.,"Dosimetry, Mode of Action, and Species Homology",Species Homology and Interspecies Sensitivity,Summary,,,,Health,Dosimetry deprecated,
2013,5.6,5,6,.,.,.,.,"Dosimetry, Mode of Action, and Species Homology",Chapter�Summary,,,,,Health,Dosimetry deprecated,
2013,6,6,.,.,.,.,.,Integrated Health Effects of Short-Term Ozone Exposure,,,,,,Health,Supplementary,
2013,6.1,6,1,.,.,.,.,Integrated Health Effects of Short-Term Ozone Exposure,Introduction,,,,,Health,Supplementary,
2013,6.2,6,2,.,.,.,.,Integrated Health Effects of Short-Term Ozone Exposure,Respiratory Effects,,,,,Health,Supplementary,
2013,6.2.1,6,2,1,.,.,.,Integrated Health Effects of Short-Term Ozone Exposure,Respiratory Effects,Lung Function,,,,Health,Supplementary,
2013,6.2.1.1,6,2,1,1,.,.,Integrated Health Effects of Short-Term Ozone Exposure,Respiratory Effects,Lung Function,Controlled Human Exposure,,,Health,Short Term Respiratory|CHE,CHE
2013,6.2.1.2,6,2,1,2,.,.,Integrated Health Effects of Short-Term Ozone Exposure,Respiratory Effects,Lung Function,Epidemiology,,,Health,Short Term Respiratory|Epi,Epi
2013,6.2.1.3,6,2,1,3,.,.,Integrated Health Effects of Short-Term Ozone Exposure,Respiratory Effects,Lung Function,Toxicology,,,Health,Short Term Respiratory|Tox,Tox
2013,6.2.2,6,2,2,.,.,.,Integrated Health Effects of Short-Term Ozone Exposure,Respiratory Effects,Airway Hyperresponsiveness,,,,Health,Supplementary,
2013,6.2.2.1,6,2,2,1,.,.,Integrated Health Effects of Short-Term Ozone Exposure,Respiratory Effects,Airway Hyperresponsiveness,Controlled Human Exposures,,,Health,Short Term Respiratory|CHE,CHE
2013,6.2.2.2,6,2,2,2,.,.,Integrated Health Effects of Short-Term Ozone Exposure,Respiratory Effects,Airway Hyperresponsiveness,Toxicology,,,Health,Short Term Respiratory|Tox,Tox
2013,6.2.3,6,2,3,.,.,.,Integrated Health Effects of Short-Term Ozone Exposure,Respiratory Effects,"Pulmonary Inflammation, Injury and Oxidative Stress",,,,Health,Supplementary,
2013,6.2.3.1,6,2,3,1,.,.,Integrated Health Effects of Short-Term Ozone Exposure,Respiratory Effects,"Pulmonary Inflammation, Injury and Oxidative Stress",Controlled Human Exposures,,,Health,Short Term Respiratory|CHE,CHE
2013,6.2.3.2,6,2,3,2,.,.,Integrated Health Effects of Short-Term Ozone Exposure,Respiratory Effects,"Pulmonary Inflammation, Injury and Oxidative Stress",Epidemiology,,,Health,Short Term Respiratory|Epi,Epi
2013,6.2.3.3,6,2,3,3,.,.,Integrated Health Effects of Short-Term Ozone Exposure,Respiratory Effects,"Pulmonary Inflammation, Injury and Oxidative Stress",Toxicology,,,Health,Short Term Respiratory|Tox,Tox
2013,6.2.4,6,2,4,.,.,.,Integrated Health Effects of Short-Term Ozone Exposure,Respiratory Effects,Respiratory Symptoms and Medication Use,,,,Health,Supplementary,